{"text_format":"1","workbook":"xlsx","n_sheets":6,"sheets":["電気工事届","電気工事設計書","メンテナンス","平面図","引込線立面図","単線結線図"],"not_rendered":{"charts":0,"images":10,"macros":1,"external_links":1,"defined_names":33,"comments":2,"pivot_tables":0},"unopened":[],"bounds":{"document_bytes":16777216,"sheet_cells":100000,"rows_first":2000,"rows_last":500,"rows_between":2000,"halvings":0,"cell_chars":16384,"cell_head_chars":4096},"cells_cut":0,"cells_raw":0,"read":"whole","date_system":"1900"}

{"sheet":"電気工事届","index":0,"n_rows":90,"n_cols":78,"rows_kept":90,"cut":false,"hidden":false,"merged":[[44,5,45,8],[48,64,48,70],[44,28,44,31],[45,28,45,31],[44,45,44,48],[44,54,45,54],[44,55,45,56],[44,62,48,63],[42,53,42,61],[43,53,43,61],[44,60,45,60],[44,10,45,13],[44,9,45,9],[41,1,42,10],[44,1,45,4],[46,1,47,4],[47,26,47,43],[44,14,45,17],[44,33,45,44],[32,63,32,64],[44,57,45,57],[28,63,28,64],[30,63,30,64],[47,54,47,59],[44,52,45,53],[44,50,45,51],[43,64,43,69],[30,65,30,67],[30,49,30,52],[32,65,32,67],[46,49,46,61],[28,55,28,56],[44,58,45,59],[28,65,28,69],[32,59,32,60],[32,61,32,62],[28,59,28,60],[28,61,28,62],[78,3,78,16],[46,6,47,14],[46,16,47,24],[64,26,64,27],[63,17,63,19],[64,17,64,19],[57,1,57,8],[56,11,56,13],[56,1,56,5],[59,20,59,23],[72,24,72,25],[74,26,75,27],[76,26,77,27],[74,17,74,19],[75,17,75,19],[74,3,74,16],[46,5,47,5],[70,3,70,16],[71,17,71,19],[67,3,67,16],[68,3,68,16],[66,3,66,16],[66,17,66,19],[48,1,51,1],[89,1,89,36],[39,0,40,70],[58,1,88,1],[80,35,81,48],[78,24,78,25],[82,52,82,56],[82,57,82,61],[83,35,85,39],[79,24,79,25],[82,50,82,51],[68,20,68,23],[69,20,69,23],[82,42,82,43],[68,28,69,28],[72,26,73,27],[68,33,69,33],[68,26,69,27],[72,30,73,30],[86,40,88,41],[52,1,55,1],[50,6,51,16],[52,6,53,24],[54,6,55,16],[51,17,51,24],[50,2,51,5],[48,2,48,5],[49,2,49,5],[68,17,68,19],[69,17,69,19],[48,6,49,24],[56,9,56,10],[66,26,66,27],[60,3,60,16],[61,3,61,16],[62,3,62,16],[63,3,63,16],[64,3,64,16],[65,3,65,16],[69,3,69,16],[57,23,57,24],[61,20,61,23],[60,24,60,33],[61,30,61,32],[62,24,62,28],[63,24,63,33],[65,24,65,33],[65,20,65,23],[67,26,67,28],[77,17,77,19],[78,17,78,19],[83,57,88,61],[84,55,84,56],[87,55,87,56],[86,52,88,54],[86,50,88,51],[83,52,85,54],[86,35,88,39],[78,33,79,33],[83,40,85,41],[82,25,84,25],[82,26,84,34],[80,24,84,24],[80,25,80,26],[81,25,81,26],[80,27,81,34],[76,28,77,28],[76,29,77,29],[76,30,77,30],[86,42,88,43],[86,44,88,45],[76,17,76,19],[79,17,79,19],[67,29,67,32],[82,35,82,39],[68,29,69,29],[72,32,73,32],[82,46,82,47],[82,44,82,45],[82,40,82,41],[72,29,73,29],[74,28,75,28],[74,29,75,29],[74,30,75,30],[74,31,75,31],[74,32,75,32],[68,42,70,54],[78,20,79,23],[74,20,75,23],[76,20,77,23],[73,24,73,25],[68,31,69,31],[68,32,69,32],[76,31,77,31],[76,32,77,32],[76,33,77,33],[78,31,79,31],[78,32,79,32],[72,31,73,31],[70,26,71,33],[72,33,73,33],[72,28,73,28],[68,24,68,25],[78,30,79,30],[74,24,74,25],[75,24,75,25],[76,24,76,25],[77,24,77,25],[69,24,69,25],[70,24,71,25],[73,3,73,16],[72,17,72,19],[73,17,73,19],[67,17,67,19],[52,2,53,5],[54,2,54,5],[55,2,55,5],[58,2,59,16],[57,12,57,13],[60,2,69,2],[65,17,65,19],[55,17,55,24],[72,3,72,16],[72,20,73,23],[70,20,70,23],[58,17,59,19],[59,24,59,33],[68,30,69,30],[62,30,62,32],[62,17,62,19],[61,17,61,19],[60,17,60,19],[60,20,60,23],[61,24,61,28],[52,51,52,53],[46,15,47,15],[53,51,53,59],[55,45,55,47],[49,48,50,58],[52,55,52,59],[50,35,50,41],[46,26,46,43],[57,30,57,31],[50,33,50,34],[57,32,57,42],[46,25,57,25],[53,27,53,29],[55,27,55,29],[57,14,57,19],[56,17,56,20],[55,30,56,42],[49,45,49,47],[46,44,51,44],[55,48,56,58],[85,2,88,2],[76,3,76,16],[80,2,84,2],[70,2,79,2],[70,17,70,19],[77,3,77,16],[80,5,81,12],[82,4,84,12],[80,13,84,13],[80,14,80,15],[81,14,81,15],[80,3,80,4],[81,3,81,4],[82,3,84,3],[82,14,84,14],[82,15,84,23],[80,16,81,23],[75,3,75,16],[85,3,88,34],[79,3,79,16],[71,3,71,16],[78,26,79,27],[78,28,79,28],[78,29,79,29],[2,12,2,13],[2,15,2,18],[16,23,16,27],[18,15,18,27],[4,24,4,35],[10,12,10,33],[30,61,30,62],[30,59,30,60],[12,12,12,33],[14,12,14,18],[30,53,30,54],[20,31,20,42],[6,58,6,61],[14,58,14,64],[16,58,16,66],[18,58,18,66],[2,58,2,63],[22,58,22,63],[22,15,22,27],[28,12,28,18],[24,58,24,63],[28,57,28,58],[24,12,24,42],[30,12,30,42],[32,12,32,32],[30,57,30,58],[30,55,30,56],[28,53,28,54],[26,12,26,32],[34,12,34,18],[44,18,45,27],[45,45,45,48],[86,46,88,47],[86,48,88,49],[32,49,32,52],[32,53,32,54],[32,55,32,56],[32,57,32,58],[52,48,52,49],[53,30,54,40],[83,42,85,43],[83,44,85,45],[83,46,85,47],[83,48,85,49],[83,50,85,51],[52,44,57,44],[74,33,75,33],[58,34,58,39],[53,64,53,70],[58,64,58,70],[56,62,56,63],[54,62,54,63],[55,62,55,63],[57,62,57,63],[58,62,58,63],[85,63,88,64],[63,64,63,70],[64,62,68,63],[68,64,68,70],[49,62,53,63],[69,62,73,63],[73,64,73,70],[59,62,63,63],[74,62,78,63],[78,64,78,70],[58,43,59,53],[77,72,77,75],[81,72,81,75],[81,77,81,80],[85,72,85,75],[74,72,74,80],[85,77,85,80],[77,77,77,80],[55,71,56,81],[60,72,60,75],[60,77,60,80],[64,72,64,75],[64,77,64,80],[68,72,68,75],[68,77,68,80],[71,72,71,75],[71,77,71,80],[82,48,82,49]]}
[null,"【入力項目】",null,null,null,null,null,null,null,null,null,null,null,null,null,null,"※入力チェックエラーでも保存可能"]
[null,"◆","引込線･計測器工事会社登録番号[必須]"]
[null,"※非組合員の方は「ZZ-999」と入力してください",null,null,null,null,null,null,null,null,null,null,null,null,"-",null,null,null,null,null,null,null,null,null,null,null,null,null,null,null,null,null,null,null,null,null,null,null,null,null,null,null,null,null,null,"◆","施工開始日[必須]"]
[]
[null,"◆","登録・届出番号[必須]",null,null,null,null,null,null,null,null,null,null,"経済産業大臣",null,null,null,null,null,null,null,"登録",null,null,{"$f":"IFERROR(VLOOKUP($BM$44,メンテナンス!A:S,17,),\"\")","v":""},null,null,null,null,null,null,null,null,null,null,null,"号",null,null,null,null,null,null,null,null,"◆","道路横断の有無[必須]",null,null,null,null,null,null,null,null,null,null,null,null,"有",null,null,"無"]
[]
[null,null,null,null,null,null,null,null,null,null,null,null,"　","産業保安監督部長",null,null,null,null,null,null,"　","届出",null,null,null,null,null,null,null,null,null,null,null,null,null,null,null,null,null,null,null,null,null,null,null,"◆","道路種別[横断有は必須]"]
[]
[null,null,null,null,null,null,null,null,null,null,null,null,"　","都道府県知事",null,null,null,null,null,null,null,null,null,null,null,null,null,null,null,null,null,null,null,null,null,null,null,null,null,null,null,null,null,null,null,"◆","引込線工事[必須]",null,null,null,null,null,null,null,null,null,null,null,null,"要",null,null,"不要"]
[]
[null,"◆","工事会社名[必須]",null,null,null,null,null,null,null,null,null,{"$f":"IFERROR(VLOOKUP($BM$44,メンテナンス!$A:$S,6,),\"\")","v":""},null,null,null,null,null,null,null,null,null,null,null,null,null,null,null,null,null,null,null,null,null,null,null,null,null,null,null,null,null,null,null,null,"◆","計測器工事[必須]",null,null,null,null,null,null,null,null,null,null,null,null,"要",null,null,"不要"]
[]
[null,"◆","工事会社住所[必須]",null,null,null,null,null,null,null,null,null,{"$f":"IFERROR(VLOOKUP($BM$44,メンテナンス!$A:$S,13,)&\"\"&VLOOKUP($BM$44,メンテナンス!$A:$S,14,),\"\")","v":""},null,null,null,null,null,null,null,null,null,null,null,null,null,null,null,null,null,null,null,null,null,null,null,null,null,null,null,null,null,null,null,null,"◆","配電線工事[必須]",null,null,null,null,null,null,null,null,null,null,null,null,"要",null,null,"不要"]
[]
[null,"◆","工事会社電話番号[必須]",null,null,null,null,null,null,null,null,null,{"$f":"IFERROR(VLOOKUP($BM$44,メンテナンス!$A:$S,10,),\"\")","v":""},null,null,null,null,null,null,null,null,null,null,null,null,null,null,null,null,null,null,null,null,null,null,null,null,null,null,null,null,null,null,null,null,"◆","工事種別[必須]"]
[]
[null,"◆","主任工事士[必須]",null,null,null,null,null,null,null,null,null,"第",null,"種電気工事士(北海道)　第",null,null,null,null,null,null,null,null,null,null,null,null,null,"号",null,null,null,null,null,null,null,null,null,null,null,null,null,null,null,null,"◆","電気方式①[必須]"]
[]
[null,null,null,null,null,null,null,null,null,null,null,null,"氏名",null,null,null,null,null,null,null,null,null,null,null,null,null,null,null,null,null,null,null,null,null,null,null,null,null,null,null,null,null,null,null,null,"◆","電気方式②[任意]"]
[]
[null,"◆","主任技術者[高圧受電の場合]",null,null,null,null,null,null,null,null,null,null,"専任",null,null,"保安協会",null,null,null,null,"管理技術者協会",null,null,null,null,null,null,"その他",null,null,null,null,null,null,null,null,null,null,null,null,null,null,null,null,"◆","本契約前の臨時契約の有無[必須]",null,null,null,null,null,null,null,null,null,null,null,null,"有",null,null,"無"]
[]
[null,null,"（低圧発電設備は必要な場合があります）",null,null,null,null,null,null,null,null,null,"氏名",null,null,null,null,null,null,null,null,null,null,null,null,null,null,null,null,null,null,null,null,null,null,null,null,null,null,null,null,null,null,null,null,"◆","臨時受付番号[臨時有は必須]"]
[]
[null,"◆","需要者住所（施工場所）[必須]",null,null,null,null,null,null,null,null,null,null,null,null,null,null,null,null,null,null,null,null,null,null,null,null,null,null,null,null,null,null,null,null,null,null,null,null,null,null,null,null,null,null,"◆","契約票番号[任意]"]
[]
[null,"◆","需要者氏名[必須]",null,null,null,null,null,null,null,null,null,null,null,null,null,null,null,null,null,null,null,null,null,null,null,null,null,null,null,null,null,null,null,null,null,null,null,null,null,null,null,null,null,null,"◆","電柱No.",null,null,null,null,"引込柱＝変圧器柱",null,null,null,null,null,null,"※新たに建柱が必要な場合は入力不要"]
[]
[null,"◆","需要者電話番号[必須]",null,null,null,null,null,null,null,null,null,null,null,null,null,null,null,null,null,null,null,null,null,null,null,null,null,null,null,null,null,null,null,null,null,null,null,null,null,null,null,null,null,null,"◆","容量",null,null,null,null,null,null,"画",null,"区",null,"図",null,"番",null,"の",null,"号",null,"変圧器容量"]
[]
{"$rows_left_out":61}
{"sheet":"電気工事設計書","index":1,"n_rows":77,"n_cols":94,"rows_kept":77,"cut":false,"hidden":false,"merged":[[31,62,32,83],[33,62,34,83],[34,36,34,39],[34,40,34,41],[29,36,29,39],[29,40,29,41],[29,43,30,61],[29,62,30,83],[25,36,25,41],[25,42,34,42],[25,43,26,61],[25,62,26,83],[26,36,26,39],[26,40,26,41],[27,36,27,39],[27,40,27,41],[28,36,28,39],[28,40,28,41],[27,43,28,61],[27,62,28,83],[32,36,32,39],[32,40,32,41],[30,36,30,39],[30,40,30,41],[33,43,34,61],[31,36,31,39],[31,40,31,41],[31,43,32,61],[25,24,25,29],[25,30,25,35],[27,34,27,35],[29,3,30,6],[29,7,30,22],[29,24,31,24],[26,30,26,33],[26,34,26,35],[28,3,28,6],[28,25,28,29],[28,30,28,33],[28,34,28,35],[26,24,28,24],[26,25,26,29],[27,3,27,6],[27,7,28,22],[29,25,29,29],[33,36,33,39],[33,40,33,41],[31,1,34,2],[31,3,34,22],[31,25,31,29],[31,30,31,33],[31,34,31,35],[29,30,29,33],[29,34,29,35],[27,1,30,2],[27,25,27,29],[27,30,27,33],[32,24,32,29],[32,30,32,33],[32,34,32,35],[30,25,30,29],[30,30,30,33],[30,34,30,35],[34,24,34,29],[34,30,34,33],[34,34,34,35],[33,24,33,29],[33,30,33,33],[33,34,33,35],[25,23,34,23],[75,4,75,5],[75,6,75,7],[75,8,75,9],[75,10,75,11],[75,12,75,13],[75,14,75,15],[75,36,75,37],[75,38,75,39],[75,16,75,17],[75,18,75,19],[75,20,75,21],[75,22,75,23],[75,24,75,25],[75,26,75,27],[49,37,51,49],[75,68,75,69],[75,73,75,77],[75,78,75,79],[75,80,75,81],[75,40,75,41],[75,42,75,43],[75,44,75,45],[75,53,75,54],[75,60,75,61],[75,62,75,63],[3,11,3,20],[7,11,7,20],[5,11,5,30],[9,11,11,30],[75,64,75,65],[75,66,75,67],[75,28,75,29],[75,30,75,31],[75,32,75,33],[75,34,75,35],[11,44,11,47],[13,44,13,47],[15,44,15,47],[3,43,3,47],[3,48,3,52],[3,53,3,57],[5,43,9,43],[5,44,5,47],[7,44,7,47],[9,44,9,47],[17,43,17,47],[19,43,19,47],[21,43,21,47],[5,51,5,52],[7,51,7,52],[9,51,9,52],[11,51,11,52],[13,51,13,52],[15,51,15,52],[11,43,15,43],[17,51,17,52],[19,51,19,52],[21,51,21,52],[5,48,5,50],[7,48,7,50],[9,48,9,50],[11,48,11,50],[13,48,13,50],[15,48,15,50],[17,48,17,50],[19,48,19,50],[21,48,21,50],[5,53,5,55],[5,56,5,57],[7,53,7,55],[7,56,7,57],[9,53,9,55],[9,56,9,57],[11,53,11,55],[11,56,11,57],[19,53,19,55],[19,56,19,57],[30,93,30,100],[36,93,36,100],[42,93,42,100],[48,93,48,100],[54,93,54,100],[61,85,61,101],[21,53,21,55],[21,56,21,57],[13,53,13,55],[13,56,13,57],[15,53,15,55],[15,56,15,57],[17,53,17,55],[17,56,17,57],[25,85,25,99],[29,85,29,99],[30,85,30,92],[36,85,36,92],[42,85,42,92],[48,85,48,92],[54,85,54,92],[24,1,24,83],[25,1,26,6],[25,7,26,22]]}
[null,"【入力項目】"]
[]
[]
[null,"◆","工事会社[必須]",null,null,null,null,null,null,null,null,{"$f":"IF(電気工事届!$M$11=\"\",\"\",電気工事届!$M$11)","v":""},null,null,null,null,null,null,null,null,null,null,null,null,null,null,null,null,null,null,null,null,"◆","分岐回路数算定内訳[任意]",null,null,null,null,null,null,null,null,null,"建物の種類"]
[]
[null,"◆","住所（施工場所）[必須]",null,null,null,null,null,null,null,null,{"$f":"IF(電気工事届!$M$25=\"\",\"\",電気工事届!$M$25)","v":""},null,null,null,null,null,null,null,null,null,null,null,null,null,null,null,null,null,null,null,null,null,null,null,null,null,null,null,null,null,null,null,"標準","床面積①",null,null,null,null,null,null,"m3",null,null,null,null,"m3"]
[]
[null,"◆","氏名[必須]",null,null,null,null,null,null,null,null,{"$f":"IF(電気工事届!$M$27=\"\",\"\",電気工事届!$M$27)","v":""},null,null,null,null,null,null,null,null,null,null,null,null,null,null,null,null,null,null,null,null,null,null,null,null,null,null,null,null,null,null,null,null,"標準VA数",null,null,null,null,null,null,"VA",null,null,null,null,"VA"]
[]
[null,"◆","記事欄[任意]",null,null,null,null,null,null,null,null,null,null,null,null,null,null,null,null,null,null,null,null,null,null,null,null,null,null,null,null,null,null,null,null,null,null,null,null,null,null,null,null,null,"総VA数",null,null,null,null,null,null,"VA",null,null,null,null,"VA"]
[]
[null,null,null,null,null,null,null,null,null,null,null,null,null,null,null,null,null,null,null,null,null,null,null,null,null,null,null,null,null,null,null,null,null,null,null,null,null,null,null,null,null,null,null,"部分","床面積①",null,null,null,null,null,null,"m3",null,null,null,null,"m3"]
[]
[null,null,null,null,null,null,null,null,null,null,null,null,null,null,null,null,null,null,null,null,null,null,null,null,null,null,null,null,null,null,null,null,null,null,null,null,null,null,null,null,null,null,null,null,"標準VA数",null,null,null,null,null,null,"VA",null,null,null,null,"VA"]
[]
[null,"◆","　","←","別紙で電気工事設計書を作成の場合は「○」（別紙参照と表示）",null,null,null,null,null,null,null,null,null,null,null,null,null,null,null,null,null,null,null,null,null,null,null,null,null,null,null,null,null,null,null,null,null,null,null,null,null,null,null,"総VA数",null,null,null,null,null,null,"VA",null,null,null,null,"VA"]
[]
[null,null,null,null,null,null,null,null,null,null,null,null,null,null,null,null,null,null,null,null,null,null,null,null,null,null,null,null,null,null,null,null,null,null,null,null,null,null,null,null,null,null,null,"加 算 V A 数",null,null,null,null,null,null,null,"VA",null,null,null,null,"VA"]
[]
[null,null,null,null,null,null,null,null,null,null,null,null,null,null,null,null,null,null,null,null,null,null,null,null,null,null,null,null,null,null,null,null,null,null,null,null,null,null,null,null,null,null,null,"総VA数（合計）",null,null,null,null,null,null,null,"VA",null,null,null,null,"VA"]
[]
[null,null,null,null,null,null,null,null,null,null,null,null,null,null,null,null,null,null,null,null,null,null,null,null,null,null,null,null,null,null,null,null,null,null,null,null,null,null,null,null,null,null,null,"回　路　数",null,null,null,null,null,null,null,"以上",null,null,null,null,"以上"]
[]
[]
[null,"電　 気　 工　 事　 設　 計　 書"]
[null,"工事会社",null,null,null,null,null,{"$f":"$L$4&\"\"","v":""},null,null,null,null,null,null,null,null,null,null,null,null,null,null,null,"分岐回路数算定内訳","建物の種類",null,null,null,null,null,{"$f":"$AW$4&\"\"","v":""},null,null,null,null,null,{"$f":"$BB$4&\"\"","v":""},null,null,null,null,null,"図面照査による訂正","１．引込線の取付位置を変更して下さい",null,null,null,null,null,null,null,null,null,null,null,null,null,null,null,null,null,null,"６．幹線の電線を太くして下さい（　　ｍｍ以上）",null,null,null,null,null,null,null,null,null,null,null,null,null,null,null,null,null,null,null,null,null,null,"↓「電気工事設計書」編集↓"]
[null,null,null,null,null,null,null,null,null,null,null,null,null,null,null,null,null,null,null,null,null,null,null,null,"標準","床面積①",null,null,null,null,{"$f":"$AW$6&\"\"","v":""},null,null,null,"㎡",null,{"$f":"$BB$6&\"\"","v":""},null,null,null,"㎡"]
[null,"お客さま",null,"住　所",null,null,null,{"$f":"$L$6&\"\"","v":""},null,null,null,null,null,null,null,null,null,null,null,null,null,null,null,null,null,"標準ＶA数",null,null,null,null,{"$f":"$AW$8&\"\"","v":""},null,null,null,"ＶＡ",null,{"$f":"$BB$8&\"\"","v":""},null,null,null,"ＶＡ",null,null,"２．計器の取付位置を変更して下さい",null,null,null,null,null,null,null,null,null,null,null,null,null,null,null,null,null,null,"７．開閉器容量を大きくして下さい（ 　Ａ以上）"]
[null,null,null,"（施工場所）",null,null,null,null,null,null,null,null,null,null,null,null,null,null,null,null,null,null,null,null,null,"総ＶＡ数",null,null,null,null,{"$f":"$AW$10&\"\"","v":""},null,null,null,"ＶＡ",null,{"$f":"$BB$10&\"\"","v":""},null,null,null,"ＶＡ"]
[null,null,null,"氏　名",null,null,null,{"$f":"$L$8&\"\"","v":""},null,null,null,null,null,null,null,null,null,null,null,null,null,null,null,null,"部分","床面積②",null,null,null,null,{"$f":"$AW$12&\"\"","v":""},null,null,null,"㎡",null,{"$f":"$BB$12&\"\"","v":""},null,null,null,"㎡",null,null,"３．分岐回路数が不足です（　　回路以上）",null,null,null,null,null,null,null,null,null,null,null,null,null,null,null,null,null,null,"８．分岐開閉器を配線用しゃ断器にして下さい",null,null,null,null,null,null,null,null,null,null,null,null,null,null,null,null,null,null,null,null,null,null,"↓「立面図」編集↓"]
{"$rows_left_out":48}
{"sheet":"メンテナンス","index":2,"n_rows":1540,"n_cols":19,"rows_kept":1540,"cut":false,"hidden":true,"merged":[]}
["北電コード","支部名","地域","B","牽引","商号","役職","代表者名","ふりがな","電話番号","ＦＡＸ","郵便番号","住所１","住所２","組合登録番号","工業組合登録番号","電気工事業法登録、届出番号","ホームページ","備考"]
["E1-301","室蘭","室蘭","","タ","拓北電業㈱室蘭支店","支店長","宮森康博","みやもり　　やすひろ","(0143)44-3191","(0143)44-3194","050-0074","室蘭市","中島町３丁目６－２","1002","札687","届(石狩)24159"]
["E1-302","室蘭","室蘭","","ホ","北光電業㈱","代表取締役","茂住彰宏","もずみ　　あきひろ","(0143)43-5344","(0143)43-5343","050-0077","室蘭市","天神町２８－１２","1003","室3","届(胆振)27023"]
["E1-305","室蘭","室蘭","","ニ","日鉄住金テックスエンジ㈱","支店長","森高常之","もりたか　　つねゆき","(0143)44-1020","(0143)45-1383","050-0087","室蘭市","仲町１２番地","1006","札594","届(大臣)46178"]
["E1-309","室蘭","室蘭","","ハ","㈱白電社","代表取締役","谷島和治","たにしま　　かずはる","(0144)82-2051","(0144)82-4753","059-0916","白老郡","白老町高砂町１丁目１－５５","1010","室10","届(胆振)25014","http://www.hakuden.co.jp"]
["E1-310","室蘭","室蘭","","タ","大和電機㈱","代表取締役","村上功","むらかみ　　いさお","(0143)47-8135","(0143)47-8136","050-0081","室蘭市","日の出町１丁目１６－８","1011","室11","届(胆振)25001"]
["E1-318","室蘭","室蘭","","ヨ","㈱吉野電気商会","代表取締役","吉野洋一","よしの　　よういち","(0143)85-2461","(0143)85-4581","059-0026","登別市","若山町１丁目５－１","1019","室19","届(胆振)24039"]
["E1-319","室蘭","室蘭","","タ","大同電設㈱","代表取締役","岸塚博","きしづか　　ひろし","(0143)44-5695","(0143)44-5667","050-0083","室蘭市","東町２丁目２４－１","1020","室20","届(大臣)46146"]
["E1-320","室蘭","室蘭","","キ","木村電機工業㈱","代表取締役","木村穰","きむら　　ゆたか","(0143)88-1200","(0143)85-5185","059-0013","登別市","幌別町３丁目９－１","1021","室21","届(胆振)24038"]
["E1-322","室蘭","室蘭","","ニ","㈲日新電設","代表取締役","三上政博","みかみ　　まさひろ","(0143)86-6145","(0143)86-1917","059-0034","登別市","鷲別町６丁目２８－２","1023","室23","届(胆振)27026"]
["E1-323","室蘭","室蘭","","ハ","早坂電気商会","代表","早坂正道","はやさか　　まさみち","(0143)43-2272","(0143)44-3977","050-0072","室蘭市","高砂町４丁目２９－１４","1024","室24","届(胆振)25002"]
["E1-326","室蘭","室蘭","","タ","太平電気㈱","代表取締役","松見哲也","まつみ　　てつや","(0143)23-1188","(0143)24-2615","051-0002","室蘭市","御前水町１丁目６－３０","1027","室27","届(胆振)25017","http://taiden.jp"]
["E1-328","室蘭","室蘭","","オ","㈲小倉電気商会","代表取締役","小倉勝正","おぐら　　かつただ","(0144)83-2101","(0144)83-2137","059-0923","白老郡","白老町字北吉原１６８","1029","室29","届(胆振)23037"]
["E1-329","室蘭","室蘭","","ソ","創成電機工業㈱","代表取締役","松島史朗","まつしま　　しろう","(0143)44-2269","(0143)44-3426","050-0076","室蘭市","知利別町２丁目１４－５","1030","室30","届(胆振)27001"]
["E1-333","室蘭","室蘭","","コ","㈱光星電業","代表取締役","沼澤侃","ぬまざわ　　つよし","(0143)22-3747","(0143)22-3759","051-0003","室蘭市","母恋南町５丁目１-１０","1034","室34","届(胆振)23001"]
["E1-334","室蘭","室蘭","","キ","共立電気工事㈱","代表取締役","伊藤隆","いとう　　たかし","(0143)44-6789","(0143)44-7427","050-0074","室蘭市","中島町4丁目8－４","1035","室35","届(胆振)26008"]
["E1-336","室蘭","室蘭","","ニ","㈱日胆テクノ室蘭工事センター","取締役工事部部長","房田克巳","ぼうだ　　かつみ","(0143)44-5470","(0143)44-5044","050-0081","室蘭市","日の出町２丁目２-１０","1037","室37"]
["E1-382","室蘭","室蘭","","セ","㈲成和電気工事","代表取締役","高橋寛","たかはし　　ひろし","(0143)55-2971","(0143)55-2977","050-0065","室蘭市","本輪西町５丁目１５－１６","1049","室49","届(胆振)23008"]
["E1-351","室蘭","室蘭","","ノ","㈲登別電工","代表取締役","宮川賢吾","みやかわ　　けんご","(0143)85-2676","(0143)85-0063","059-0014","登別市","富士町１丁目１６－１５","1052","室52","届(胆振)23009"]
["E1-368","室蘭","室蘭","","ラ","㈲蘭東電気","代表取締役","佐藤健二","さとう　　けんじ","(0143)43-2411","(0143)43-2248","050-0073","室蘭市","宮の森町４丁目２－２７","1055","室55","届(胆振)01258"]
["E1-361","室蘭","室蘭","","コ","㈱耕電設","代表取締役","千葉昌子","ちば　　しょうこ","(0143)43-2332","(0143)43-7180","050-0074","室蘭市","中島町４丁目１７－３３","1062","室62","届(胆振)22017"]
["E1-363","室蘭","室蘭","","メ","㈱メイセイ","代表取締役","小山田享誌","おやまだ　　たかし","(0143)45-8822","(0143)45-0323","050-0082","室蘭市","寿町３丁目９－６","1064","室64","届(胆振)24004"]
["E1-367","室蘭","室蘭","","キ","北電工","代表","佐々木晴夫","ささき　　はれお","(0143)46-2557","(0143)46-2557","050-0061","室蘭市","八丁平４丁目３９－６","1068","室68","登(胆振)27001"]
["E1-369","室蘭","室蘭","","ワ","和田電気商会","代表","和田利雄","わだ　　としお","(0143)46-0290","(0143)59-7313","050-0081","室蘭市","日の出町２丁目１５－１４","1069","室69","登(胆振)25008"]
["E1-372","室蘭","室蘭","","ト","㈲東和電工","代表取締役","杉本武捷","すぎもと　　たけかつ","(0143)55-4505","(0143)55-4505","050-0064","室蘭市","柏木町２７－２","1072","室72","登(胆振)25013"]
["E1-373","室蘭","室蘭","","ア","相光日照電気㈱","代表取締役","亀田昌和","かめだ　　まさかず","(0143)41-3151","(0143)41-3152","050-0083","室蘭市","東町３丁目２０-１","1073","室73","届(胆振)24020"]
["E1-376","室蘭","室蘭","","コ","㈲恒栄電気工事","代表取締役","佐藤則寿","さとう　　のりとし","(0143)43-0321","(0143)44-0317","050-0061","室蘭市","八丁平４丁目２８－６","1080","室80","届(胆振)24036"]
["E1-383","室蘭","室蘭","","コ","小松電設","代表","小松義幸","こまつ　　よしゆき","(0143)55-2085","(0143)55-2085","050-0063","室蘭市","港北町１丁目１０－１７","1083","室83","届(胆振)23006"]
["E1-385","室蘭","室蘭","","テ","鐵和電設㈱","代表取締役","徳本栄一","とくもと　　えいいち","(0143)43-1748","(0143)43-1795","050-0074","室蘭市","中島町３丁目２２－１０","1084","室84","届(胆振)24013","http://tetsuwa-densetsu.com/"]
["E1-390","室蘭","室蘭","","タ","㈱大誠電機","代表取締役","能山猛","のうやま　　たけし","(0143)24-2527","(0143)22-3860","051-0031","室蘭市","築地町８９-２５","1088","室88","届(胆振)22035"]
{"$rows_left_out":1511}
{"sheet":"平面図","index":3,"n_rows":0,"n_cols":0,"rows_kept":0,"cut":false,"hidden":true,"merged":[]}

{"sheet":"引込線立面図","index":4,"n_rows":0,"n_cols":0,"rows_kept":0,"cut":false,"hidden":true,"merged":[]}

{"sheet":"単線結線図","index":5,"n_rows":0,"n_cols":0,"rows_kept":0,"cut":false,"hidden":true,"merged":[]}